{"text_format":"1","workbook":"xlsx","n_sheets":7,"sheets":["(はじめにお読み下さい)申請書の使い方","実績報告書","実績額一覧","別添","個票1","職員表","計算用"],"not_rendered":{"charts":0,"images":0,"macros":1,"external_links":0,"defined_names":8,"comments":4,"pivot_tables":0},"unopened":[],"bounds":{"document_bytes":16777216,"sheet_cells":100000,"rows_first":2000,"rows_last":500,"rows_between":2000,"halvings":0,"cell_chars":16384,"cell_head_chars":4096},"cells_cut":0,"cells_raw":0,"read":"whole","date_system":"1900"}

{"sheet":"(はじめにお読み下さい)申請書の使い方","index":0,"n_rows":15,"n_cols":4,"rows_kept":15,"cut":false,"hidden":false,"merged":[[1,0,1,3]]}
[]
["本実績報告書の使い方、申請の手順"]
[]
["手順","都道府県の作業","事業者（法人本部）の作業","各事業所の作業"]
[1,"本Excelを管内の介護サービス事業者に配布"]
[{"$f":"A5+1","v":2},null,"本Excelを各事業所に配布し、以下の様式への記入を依頼\n・様式第８－２号（個票）\n・様式第８－３号（職員票）\n※Excelファイルを開封した際は、｢コンテンツの有効化｣をクリック\n"]
[{"$f":"A6+1","v":3},null,null,"以下の作業を行った上で、事業者（法人本部）へ返送\n【様式第８－２号（個票）】\n・水色セル：必要情報を入力\n・緑色セル：プルダウンから選択\n【様式第８－３号（職員票）】\n・慰労金を給付した職員について、様式第８－３号に取りまとめ(青色及び緑色のセルに入力)\n・「慰労金を職員等に対して給付した際の証憑書類（従事者等１人１人に申請額と同額の慰労金の給付が行われていることが確認できる書類）」「慰労金を職員等に対して給付する際に要した振込手数料にかかる証憑書類」を取りまとめ\n"]
[4,null,"各事業所の個票のシートを１つのExcelファイルに集約し、個票シート名を「個票●」（●は１からの通し番号）に修正\n"]
[5,null,"各事業所の様式第８－３号（職員表）を法人単位で一覧表として取りまとめ\n兼務する複数の介護サービス事業所等から重複して申請している者がいないかを確認\n※氏名（漢字、カナ）、生年月日が一致する者がいる場合、「重複申請者確認用」欄に「可」と表示されません。\n※記入欄が不足する場合は、6行目～85行目を行ごとコピーし、86行目に右クリック→「コピーしたセルの挿入」で挿入。\n"]
[6,null,"様式第８－２号（個票）の内容が、別添（サービス別一覧）に正しく反映されていることを確認\n※別添の記入欄が不足する場合は、6行目～20行目を行ごとコピーし、21行目に右クリック→「コピーしたセルの挿入」で挿入。\n"]
{"$rows_left_out":6}
{"sheet":"実績報告書","index":1,"n_rows":51,"n_cols":62,"rows_kept":51,"cut":false,"hidden":false,"merged":[[50,28,50,36],[49,20,50,22],[49,24,49,27],[50,24,50,27],[9,0,9,38],[47,20,47,26],[48,20,48,26],[47,28,47,36],[48,28,48,36],[49,28,49,36],[15,1,15,9],[15,10,15,17],[46,28,46,36],[45,20,46,27],[45,29,45,32],[14,0,14,38],[21,59,21,60],[23,59,23,60],[2,35,2,36],[2,32,2,33],[2,29,2,30],[6,22,6,36],[7,22,7,36],[18,17,18,23],[19,17,20,20],[2,27,2,28],[23,21,24,23],[21,21,22,23],[19,21,20,23],[19,24,20,27],[19,28,20,30],[21,24,22,27],[21,47,21,48],[21,53,21,54],[23,47,23,48],[23,53,23,54],[24,3,24,16],[21,3,21,16],[22,3,22,16],[23,3,23,16],[21,17,22,20],[23,17,24,20],[18,31,18,37],[21,28,22,30],[23,24,24,27],[23,28,24,30],[25,24,26,27],[25,28,26,30],[18,2,18,16],[27,17,28,20],[27,21,28,23],[27,24,28,27],[27,28,28,30],[18,24,18,30],[25,3,25,16],[26,3,26,16],[19,3,19,16],[25,17,26,20],[25,21,26,23],[27,31,28,34],[27,35,28,37],[27,2,28,16],[19,35,20,37],[21,31,22,34],[21,35,22,37],[23,31,24,34],[23,35,24,37],[19,31,20,34],[25,31,26,34],[25,35,26,37],[12,0,12,38],[13,0,13,38],[4,6,4,12],[4,0,4,5],[11,1,11,17],[11,18,11,38]]}
[null,null,null,null,null,null,null,null,null,null,null,null,null,null,null,null,null,null,null,null,null,null,null,null,null,null,null,null,null,null,null,null,null,null,null,null,null,null,"（様式第8号）"]
[]
[null,null,null,null,null,null,null,null,null,null,null,null,null,null,null,null,null,null,null,null,null,null,null,null,null,null,null,"令和",null,null,null,"年",null,null,"月",null,null,"日"]
[]
["千葉県知事",null,null,null,null,null,null,null,null,null,null,null,null,null,"様"]
[]
[null,null,null,null,null,null,null,null,null,null,null,null,null,null,null,null,null,null,null,null,null,null,"（法人名）"]
[null,null,null,null,null,null,null,null,null,null,null,null,null,null,null,null,null,null,null,null,null,null,"（役職・代表者名）"]
[]
["令和２年度新型コロナウイルス感染症緊急包括支援交付金（介護分）に係る実績報告書"]
{"$rows_left_out":42}
{"sheet":"実績額一覧","index":2,"n_rows":104,"n_cols":23,"rows_kept":104,"cut":false,"hidden":false,"merged":[[2,0,3,0],[2,2,3,2],[2,1,3,1],[2,3,3,3],[2,4,3,4],[2,13,2,17],[2,18,2,22],[2,5,3,5],[2,6,3,6],[2,7,2,12]]}
["（様式第８－１号）事業所・施設別実績額一覧"]
[]
["No.","介護保険\n事業所番号","事業所・施設名","電話番号","郵便番号","住所","代表となる\n事業所・施設名","実績報告額（千円）",null,null,null,null,null,"交付済額（千円）",null,null,null,null,"返還額（千円）"]
[null,null,null,null,null,null,null,"介護\n慰労金","20万円\n対象者の\n有無","感染対策\n費用助成\n事業","個別再開\n支援助成\n事業","再開環境\n整備助成\n事業","合計","介護\n慰労金","感染対策\n費用助成\n事業","個別再開\n支援助成\n事業","再開環境\n整備助成\n事業","合計","介護\n慰労金","感染対策\n費用助成\n事業","個別再開\n支援助成\n事業","再開環境\n整備助成\n事業","合計"]
[{"$f":"ROW()-4","v":1},null,{"$f":"IFERROR(VLOOKUP($B5,別添!$B$5:$G$29,2,FALSE),\"\")","v":0},{"$f":"IFERROR(VLOOKUP($B5,別添!$B$5:$G$29,4,FALSE),\"\")","v":0},{"$f":"IFERROR(VLOOKUP($B5,別添!$B$5:$G$29,5,FALSE),\"\")","v":0},{"$f":"IFERROR(VLOOKUP($B5,別添!$B$5:$G$29,6,FALSE),\"\")","v":""},{"$f":"IF(M5>0,実績報告書!$W$7,\"\")","v":""},{"$f":"SUMIFS(別添!I$5:I$29,別添!$B$5:$B$29,$B5)","v":0},{"$f":"IFERROR(IF(COUNTIFS(別添!$B$5:$B$29,B5,別添!$J$5:$J$29,\"有\")>0,\"有\",\"\"),\"\")","v":""},{"$f":"SUMIFS(別添!K$5:K$29,別添!$B$5:$B$29,$B5)","v":0},{"$f":"SUMIFS(別添!L$5:L$29,別添!$B$5:$B$29,$B5)","v":0},{"$f":"SUMIFS(別添!M$5:M$29,別添!$B$5:$B$29,$B5)","v":0},{"$f":"SUM(H5,J5,K5,L5)","v":0},{"$f":"SUMIFS(別添!O$5:O$29,別添!$B$5:$B$29,$B5)","v":0},{"$f":"SUMIFS(別添!P$5:P$29,別添!$B$5:$B$29,$B5)","v":0},{"$f":"SUMIFS(別添!Q$5:Q$29,別添!$B$5:$B$29,$B5)","v":0},{"$f":"SUMIFS(別添!R$5:R$29,別添!$B$5:$B$29,$B5)","v":0},{"$f":"SUM(N5,O5,P5,Q5)","v":0},{"$f":"SUMIFS(別添!T$5:T$29,別添!$B$5:$B$29,$B5)","v":0},{"$f":"SUMIFS(別添!U$5:U$29,別添!$B$5:$B$29,$B5)","v":0},{"$f":"SUMIFS(別添!V$5:V$29,別添!$B$5:$B$29,$B5)","v":0},{"$f":"SUMIFS(別添!W$5:W$29,別添!$B$5:$B$29,$B5)","v":0},{"$f":"SUM(S5,T5,U5,V5)","v":0}]
[{"$f":"ROW()-4","v":2},null,{"$f":"IFERROR(VLOOKUP($B6,別添!$B$5:$G$29,2,FALSE),\"\")","v":0},{"$f":"IFERROR(VLOOKUP($B6,別添!$B$5:$G$29,4,FALSE),\"\")","v":0},{"$f":"IFERROR(VLOOKUP($B6,別添!$B$5:$G$29,5,FALSE),\"\")","v":0},{"$f":"IFERROR(VLOOKUP($B6,別添!$B$5:$G$29,6,FALSE),\"\")","v":""},{"$f":"IF(M6>0,実績報告書!$W$7,\"\")","v":""},{"$f":"SUMIFS(別添!I$5:I$29,別添!$B$5:$B$29,$B6)","v":0},{"$f":"IFERROR(IF(COUNTIFS(別添!$B$5:$B$29,B6,別添!$J$5:$J$29,\"有\")>0,\"有\",\"\"),\"\")","v":""},{"$f":"SUMIFS(別添!K$5:K$29,別添!$B$5:$B$29,$B6)","v":0},{"$f":"SUMIFS(別添!L$5:L$29,別添!$B$5:$B$29,$B6)","v":0},{"$f":"SUMIFS(別添!M$5:M$29,別添!$B$5:$B$29,$B6)","v":0},{"$f":"SUM(H6,J6,K6,L6)","v":0},{"$f":"SUMIFS(別添!O$5:O$29,別添!$B$5:$B$29,$B6)","v":0},{"$f":"SUMIFS(別添!P$5:P$29,別添!$B$5:$B$29,$B6)","v":0},{"$f":"SUMIFS(別添!Q$5:Q$29,別添!$B$5:$B$29,$B6)","v":0},{"$f":"SUMIFS(別添!R$5:R$29,別添!$B$5:$B$29,$B6)","v":0},{"$f":"SUM(N6,O6,P6,Q6)","v":0},{"$f":"SUMIFS(別添!T$5:T$29,別添!$B$5:$B$29,$B6)","v":0},{"$f":"SUMIFS(別添!U$5:U$29,別添!$B$5:$B$29,$B6)","v":0},{"$f":"SUMIFS(別添!V$5:V$29,別添!$B$5:$B$29,$B6)","v":0},{"$f":"SUMIFS(別添!W$5:W$29,別添!$B$5:$B$29,$B6)","v":0},{"$f":"SUM(S6,T6,U6,V6)","v":0}]
[3,"",{"$f":"IFERROR(VLOOKUP($B7,別添!$B$5:$G$29,2,FALSE),\"\")","v":""},{"$f":"IFERROR(VLOOKUP($B7,別添!$B$5:$G$29,4,FALSE),\"\")","v":""},{"$f":"IFERROR(VLOOKUP($B7,別添!$B$5:$G$29,5,FALSE),\"\")","v":""},{"$f":"IFERROR(VLOOKUP($B7,別添!$B$5:$G$29,6,FALSE),\"\")","v":""},{"$f":"IF(M7>0,実績報告書!$W$7,\"\")","v":""},{"$f":"SUMIFS(別添!I$5:I$29,別添!$B$5:$B$29,$B7)","v":0},{"$f":"IFERROR(IF(COUNTIFS(別添!$B$5:$B$29,B7,別添!$J$5:$J$29,\"有\")>0,\"有\",\"\"),\"\")","v":""},{"$f":"SUMIFS(別添!K$5:K$29,別添!$B$5:$B$29,$B7)","v":0},{"$f":"SUMIFS(別添!L$5:L$29,別添!$B$5:$B$29,$B7)","v":0},{"$f":"SUMIFS(別添!M$5:M$29,別添!$B$5:$B$29,$B7)","v":0},0,{"$f":"SUMIFS(別添!O$5:O$29,別添!$B$5:$B$29,$B7)","v":0},{"$f":"SUMIFS(別添!P$5:P$29,別添!$B$5:$B$29,$B7)","v":0},{"$f":"SUMIFS(別添!Q$5:Q$29,別添!$B$5:$B$29,$B7)","v":0},{"$f":"SUMIFS(別添!R$5:R$29,別添!$B$5:$B$29,$B7)","v":0},0,{"$f":"SUMIFS(別添!T$5:T$29,別添!$B$5:$B$29,$B7)","v":0},{"$f":"SUMIFS(別添!U$5:U$29,別添!$B$5:$B$29,$B7)","v":0},{"$f":"SUMIFS(別添!V$5:V$29,別添!$B$5:$B$29,$B7)","v":0},{"$f":"SUMIFS(別添!W$5:W$29,別添!$B$5:$B$29,$B7)","v":0},0]
[4,null,{"$f":"IFERROR(VLOOKUP($B8,別添!$B$5:$G$29,2,FALSE),\"\")","v":0},{"$f":"IFERROR(VLOOKUP($B8,別添!$B$5:$G$29,4,FALSE),\"\")","v":0},{"$f":"IFERROR(VLOOKUP($B8,別添!$B$5:$G$29,5,FALSE),\"\")","v":0},{"$f":"IFERROR(VLOOKUP($B8,別添!$B$5:$G$29,6,FALSE),\"\")","v":""},{"$f":"IF(M8>0,実績報告書!$W$7,\"\")","v":""},{"$f":"SUMIFS(別添!I$5:I$29,別添!$B$5:$B$29,$B8)","v":0},{"$f":"IFERROR(IF(COUNTIFS(別添!$B$5:$B$29,B8,別添!$J$5:$J$29,\"有\")>0,\"有\",\"\"),\"\")","v":""},{"$f":"SUMIFS(別添!K$5:K$29,別添!$B$5:$B$29,$B8)","v":0},{"$f":"SUMIFS(別添!L$5:L$29,別添!$B$5:$B$29,$B8)","v":0},{"$f":"SUMIFS(別添!M$5:M$29,別添!$B$5:$B$29,$B8)","v":0},0,{"$f":"SUMIFS(別添!O$5:O$29,別添!$B$5:$B$29,$B8)","v":0},{"$f":"SUMIFS(別添!P$5:P$29,別添!$B$5:$B$29,$B8)","v":0},{"$f":"SUMIFS(別添!Q$5:Q$29,別添!$B$5:$B$29,$B8)","v":0},{"$f":"SUMIFS(別添!R$5:R$29,別添!$B$5:$B$29,$B8)","v":0},0,{"$f":"SUMIFS(別添!T$5:T$29,別添!$B$5:$B$29,$B8)","v":0},{"$f":"SUMIFS(別添!U$5:U$29,別添!$B$5:$B$29,$B8)","v":0},{"$f":"SUMIFS(別添!V$5:V$29,別添!$B$5:$B$29,$B8)","v":0},{"$f":"SUMIFS(別添!W$5:W$29,別添!$B$5:$B$29,$B8)","v":0},0]
[5,null,{"$f":"IFERROR(VLOOKUP($B9,別添!$B$5:$G$29,2,FALSE),\"\")","v":0},{"$f":"IFERROR(VLOOKUP($B9,別添!$B$5:$G$29,4,FALSE),\"\")","v":0},{"$f":"IFERROR(VLOOKUP($B9,別添!$B$5:$G$29,5,FALSE),\"\")","v":0},{"$f":"IFERROR(VLOOKUP($B9,別添!$B$5:$G$29,6,FALSE),\"\")","v":""},{"$f":"IF(M9>0,実績報告書!$W$7,\"\")","v":""},{"$f":"SUMIFS(別添!I$5:I$29,別添!$B$5:$B$29,$B9)","v":0},{"$f":"IFERROR(IF(COUNTIFS(別添!$B$5:$B$29,B9,別添!$J$5:$J$29,\"有\")>0,\"有\",\"\"),\"\")","v":""},{"$f":"SUMIFS(別添!K$5:K$29,別添!$B$5:$B$29,$B9)","v":0},{"$f":"SUMIFS(別添!L$5:L$29,別添!$B$5:$B$29,$B9)","v":0},{"$f":"SUMIFS(別添!M$5:M$29,別添!$B$5:$B$29,$B9)","v":0},0,{"$f":"SUMIFS(別添!O$5:O$29,別添!$B$5:$B$29,$B9)","v":0},{"$f":"SUMIFS(別添!P$5:P$29,別添!$B$5:$B$29,$B9)","v":0},{"$f":"SUMIFS(別添!Q$5:Q$29,別添!$B$5:$B$29,$B9)","v":0},{"$f":"SUMIFS(別添!R$5:R$29,別添!$B$5:$B$29,$B9)","v":0},0,{"$f":"SUMIFS(別添!T$5:T$29,別添!$B$5:$B$29,$B9)","v":0},{"$f":"SUMIFS(別添!U$5:U$29,別添!$B$5:$B$29,$B9)","v":0},{"$f":"SUMIFS(別添!V$5:V$29,別添!$B$5:$B$29,$B9)","v":0},{"$f":"SUMIFS(別添!W$5:W$29,別添!$B$5:$B$29,$B9)","v":0},0]
[6,null,{"$f":"IFERROR(VLOOKUP($B10,別添!$B$5:$G$29,2,FALSE),\"\")","v":0},{"$f":"IFERROR(VLOOKUP($B10,別添!$B$5:$G$29,4,FALSE),\"\")","v":0},{"$f":"IFERROR(VLOOKUP($B10,別添!$B$5:$G$29,5,FALSE),\"\")","v":0},{"$f":"IFERROR(VLOOKUP($B10,別添!$B$5:$G$29,6,FALSE),\"\")","v":""},{"$f":"IF(M10>0,実績報告書!$W$7,\"\")","v":""},{"$f":"SUMIFS(別添!I$5:I$29,別添!$B$5:$B$29,$B10)","v":0},{"$f":"IFERROR(IF(COUNTIFS(別添!$B$5:$B$29,B10,別添!$J$5:$J$29,\"有\")>0,\"有\",\"\"),\"\")","v":""},{"$f":"SUMIFS(別添!K$5:K$29,別添!$B$5:$B$29,$B10)","v":0},{"$f":"SUMIFS(別添!L$5:L$29,別添!$B$5:$B$29,$B10)","v":0},{"$f":"SUMIFS(別添!M$5:M$29,別添!$B$5:$B$29,$B10)","v":0},0,{"$f":"SUMIFS(別添!O$5:O$29,別添!$B$5:$B$29,$B10)","v":0},{"$f":"SUMIFS(別添!P$5:P$29,別添!$B$5:$B$29,$B10)","v":0},{"$f":"SUMIFS(別添!Q$5:Q$29,別添!$B$5:$B$29,$B10)","v":0},{"$f":"SUMIFS(別添!R$5:R$29,別添!$B$5:$B$29,$B10)","v":0},0,{"$f":"SUMIFS(別添!T$5:T$29,別添!$B$5:$B$29,$B10)","v":0},{"$f":"SUMIFS(別添!U$5:U$29,別添!$B$5:$B$29,$B10)","v":0},{"$f":"SUMIFS(別添!V$5:V$29,別添!$B$5:$B$29,$B10)","v":0},{"$f":"SUMIFS(別添!W$5:W$29,別添!$B$5:$B$29,$B10)","v":0},0]
{"$rows_left_out":95}
{"sheet":"別添","index":3,"n_rows":32,"n_cols":50,"rows_kept":32,"cut":false,"hidden":false,"merged":[[2,19,2,23],[2,14,2,18],[2,4,3,4],[2,8,2,13],[2,0,3,0],[2,1,3,1],[2,2,3,2],[2,3,3,3],[2,7,3,7],[2,6,3,6],[2,5,3,5]]}
["（別添）事業所・施設別実績額一覧（サービス別一覧）"]
[]
["No.","介護保険\n事業所番号","事業所・施設名","サービス種別","電話番号","郵便番号","住所","代表となる\n事業所・施設名","実績報告額（千円）",null,null,null,null,null,"交付済額（千円）",null,null,null,null,"返還額（千円）"]
[null,null,null,null,null,null,null,null,"介護\n慰労金","20万円\n対象者\nの有無","感染対策\n費用助成\n事業","個別再開\n支援助成\n事業","再開環境\n整備助成\n事業","合計","介護\n慰労金","感染対策\n費用助成\n事業","個別再開\n支援助成\n事業","再開環境\n整備助成\n事業","合計","介護\n慰労金","感染対策\n費用助成\n事業","個別再開\n支援助成\n事業","再開環境\n整備助成\n事業","合計"]
[{"$f":"ROW()-4","v":1},{"$f":"IFERROR(INDIRECT(\"個票\"&$A5&\"！$h$7\"),\"\")","v":0},{"$f":"IFERROR(INDIRECT(\"個票\"&$A5&\"！$t$7\"),\"\")","v":0},{"$f":"IFERROR(INDIRECT(\"個票\"&$A5&\"！$h$10\"),\"\")","v":0},{"$f":"IFERROR(INDIRECT(\"個票\"&$A5&\"！$AC$9\"),\"\")","v":0},{"$f":"IFERROR(INDIRECT(\"個票\"&$A5&\"！$d$9\"),\"\")","v":0},{"$f":"IFERROR(INDIRECT(\"個票\"&$A5&\"！$H$9\")&INDIRECT(\"個票\"&$A5&\"！$L$9\"),\"\")","v":""},{"$f":"IF(N5>0,実績報告書!$W$7,\"\")","v":""},{"$f":"IFERROR(INDIRECT(\"個票\"&$A5&\"！$ai$16\"),\"\")","v":0},{"$f":"IFERROR(INDIRECT(\"個票\"&$A5&\"！$ao$19\"),\"\")","v":0},{"$f":"IFERROR(INDIRECT(\"個票\"&$A5&\"！$ai$24\"),\"\")","v":0},{"$f":"IFERROR(INDIRECT(\"個票\"&$A5&\"！$ai$65\"),\"\")","v":0},{"$f":"IFERROR(INDIRECT(\"個票\"&$A5&\"！$ai$76\"),\"\")","v":0},{"$f":"SUM(I5,K5,L5,M5)","v":0},{"$f":"IFERROR(INDIRECT(\"個票\"&$A5&\"！$ai$17\"),\"\")","v":0},{"$f":"IFERROR(INDIRECT(\"個票\"&$A5&\"！$ai$25\"),\"\")","v":0},{"$f":"IFERROR(INDIRECT(\"個票\"&$A5&\"！$ai$66\"),\"\")","v":0},{"$f":"IFERROR(INDIRECT(\"個票\"&$A5&\"！$ai$77\"),\"\")","v":0},{"$f":"SUM(O5,P5,Q5,R5)","v":0},{"$f":"IFERROR(INDIRECT(\"個票\"&$A5&\"！$ai$18\"),\"\")","v":0},{"$f":"IFERROR(INDIRECT(\"個票\"&$A5&\"！$ai$26\"),\"\")","v":0},{"$f":"IFERROR(INDIRECT(\"個票\"&$A5&\"！$ai$67\"),\"\")","v":0},{"$f":"IFERROR(INDIRECT(\"個票\"&$A5&\"！$ai$78\"),\"\")","v":0},{"$f":"SUM(T5,U5,V5,W5)","v":0},null,null,{"$f":"IF(_xlfn.SHEETS()-6=COUNTIF(N5:N32,\">0\"),\"○\",\"！（本表の事業所数と個票の枚数が一致しません）\")","v":"！（本表の事業所数と個票の枚数が一致しません）"},null,null,null,null,null,null,null,null,null,null,null,null,null,null,null,null,null,null,null,null,null,{"$f":"IFERROR(INDIRECT(\"個票\"&$A5&\"！$m$19\"),\"\")","v":0},{"$f":"IFERROR(INDIRECT(\"個票\"&$A5&\"！$v$19\"),\"\")","v":0}]
[{"$f":"ROW()-4","v":2},{"$f":"IFERROR(INDIRECT(\"個票\"&$A6&\"！$h$7\"),\"\")","v":""},"","","","","",{"$f":"IF(N6>0,実績報告書!$W$7,\"\")","v":""},{"$f":"IFERROR(INDIRECT(\"個票\"&$A6&\"！$ai$16\"),\"\")","v":""},{"$f":"IFERROR(INDIRECT(\"個票\"&$A6&\"！$ao$19\"),\"\")","v":""},{"$f":"IFERROR(INDIRECT(\"個票\"&$A6&\"！$ai$24\"),\"\")","v":""},{"$f":"IFERROR(INDIRECT(\"個票\"&$A6&\"！$ai$65\"),\"\")","v":""},{"$f":"IFERROR(INDIRECT(\"個票\"&$A6&\"！$ai$76\"),\"\")","v":""},{"$f":"SUM(I6,K6,L6,M6)","v":0},{"$f":"IFERROR(INDIRECT(\"個票\"&$A6&\"！$ai$17\"),\"\")","v":""},{"$f":"IFERROR(INDIRECT(\"個票\"&$A6&\"！$ai$25\"),\"\")","v":""},{"$f":"IFERROR(INDIRECT(\"個票\"&$A6&\"！$ai$66\"),\"\")","v":""},{"$f":"IFERROR(INDIRECT(\"個票\"&$A6&\"！$ai$77\"),\"\")","v":""},{"$f":"SUM(O6,P6,Q6,R6)","v":0},{"$f":"IFERROR(INDIRECT(\"個票\"&$A6&\"！$ai$18\"),\"\")","v":""},{"$f":"IFERROR(INDIRECT(\"個票\"&$A6&\"！$ai$26\"),\"\")","v":""},{"$f":"IFERROR(INDIRECT(\"個票\"&$A6&\"！$ai$67\"),\"\")","v":""},{"$f":"IFERROR(INDIRECT(\"個票\"&$A6&\"！$ai$78\"),\"\")","v":""},{"$f":"SUM(T6,U6,V6,W6)","v":0},null,null,null,null,null,null,null,null,null,null,null,null,null,null,null,null,null,null,null,null,null,null,null,null,"",""]
[3,{"$f":"IFERROR(INDIRECT(\"個票\"&$A7&\"！$h$7\"),\"\")","v":""},"","","","","",{"$f":"IF(N7>0,実績報告書!$W$7,\"\")","v":""},"","","","","",0,"","","","",0,"","","","",0,null,null,null,null,null,null,null,null,null,null,null,null,null,null,null,null,null,null,null,null,null,null,null,null,"",""]
[4,"","","","","","",{"$f":"IF(N8>0,実績報告書!$W$7,\"\")","v":""},"","","","","",0,"","","","",0,"","","","",0,null,null,null,null,null,null,null,null,null,null,null,null,null,null,null,null,null,null,null,null,null,null,null,null,"",""]
[5,"","","","","","",{"$f":"IF(N9>0,実績報告書!$W$7,\"\")","v":""},"","","","","",0,"","","","",0,"","","","",0,null,null,null,null,null,null,null,null,null,null,null,null,null,null,null,null,null,null,null,null,null,null,null,null,"",""]
[6,"","","","","","",{"$f":"IF(N10>0,実績報告書!$W$7,\"\")","v":""},"","","","","",0,"","","","",0,"","","","",0,null,null,null,null,null,null,null,null,null,null,null,null,null,null,null,null,null,null,null,null,null,null,null,null,"",""]
{"$rows_left_out":23}
{"sheet":"個票1","index":4,"n_rows":102,"n_cols":84,"rows_kept":102,"cut":false,"hidden":false,"merged":[[101,0,101,38],[9,7,9,16],[72,34,72,36],[72,37,72,38],[67,37,67,38],[19,0,19,29],[19,30,19,32],[19,33,19,34],[18,0,18,6],[18,25,18,29],[19,35,19,38],[18,33,18,34],[18,35,18,38],[15,29,15,33],[15,28,17,28],[16,29,16,33],[16,34,16,36],[16,37,16,38],[17,29,17,33],[17,34,17,36],[17,37,17,38],[9,17,9,22],[24,23,25,25],[24,26,25,27],[2,0,2,38],[4,0,4,38],[6,14,6,18],[7,0,8,2],[7,7,7,10],[8,7,8,10],[7,25,8,27],[6,7,6,13],[6,19,6,38],[6,0,6,6],[8,28,8,32],[7,28,7,32],[8,3,8,6],[7,3,7,6],[7,33,7,38],[8,33,8,38],[7,11,7,24],[8,11,8,24],[25,37,25,38],[18,30,18,32],[24,34,24,36],[67,23,67,25],[68,37,68,38],[9,0,9,6],[9,23,9,24],[67,0,68,9],[68,23,68,25],[68,26,68,27],[68,28,68,33],[68,34,68,36],[67,26,67,27],[35,5,35,14],[36,5,36,14],[37,5,37,14],[27,1,29,4],[27,5,27,14],[28,5,28,14],[29,5,29,14],[30,5,30,14],[21,1,21,20],[21,21,21,23],[21,24,21,38],[9,41,9,46],[23,37,23,38],[18,7,18,11],[18,12,18,14],[18,16,18,20],[18,21,18,23],[9,35,9,36],[9,32,9,34],[9,25,9,27],[9,28,9,29],[9,30,9,31],[10,0,11,7],[23,34,23,36],[23,23,23,27],[23,28,25,28],[9,37,9,38],[15,34,15,36],[15,37,15,38],[23,29,23,33],[24,29,24,33],[25,29,25,33],[13,0,13,38],[24,37,24,38],[25,34,25,36],[77,37,77,38],[76,23,77,25],[76,26,77,27],[75,23,75,27],[75,28,77,28],[76,34,76,36],[76,37,76,38],[75,37,75,38],[75,34,75,36],[55,5,55,14],[38,5,38,14],[39,5,39,14],[40,5,40,14],[85,5,85,14],[86,5,86,14],[84,5,84,14],[78,19,78,38],[78,15,78,18],[79,19,79,38],[67,28,67,33],[67,34,67,36],[69,34,69,36],[72,26,72,27],[69,26,69,27],[69,28,69,33],[71,26,71,27],[71,28,71,33],[71,34,71,36],[77,34,77,36],[69,23,69,25],[72,28,72,33],[77,29,77,33],[69,1,72,9],[56,5,56,14],[57,5,57,14],[26,0,26,14],[27,0,57,0],[31,5,31,14],[32,5,32,14],[33,5,33,14],[34,5,34,14],[55,1,57,4],[49,1,54,4],[46,1,48,4],[43,1,45,4],[38,1,42,4],[37,1,37,4],[36,1,36,4],[33,1,35,4],[30,1,32,4],[48,5,48,14],[49,5,49,14],[50,5,50,14],[51,5,51,14],[52,5,52,14],[53,5,53,14],[54,5,54,14],[28,15,28,18],[29,15,29,18],[30,15,30,18],[31,15,31,18],[32,15,32,18],[33,15,33,18],[34,15,34,18],[41,5,41,14],[42,5,42,14],[47,5,47,14],[46,15,46,18],[47,15,47,18],[48,15,48,18],[49,15,49,18],[50,15,50,18],[51,15,51,18],[35,15,35,18],[36,15,36,18],[37,15,37,18],[38,15,38,18],[39,15,39,18],[40,15,40,18],[41,15,41,18],[42,15,42,18],[43,15,43,18],[43,5,43,14],[44,5,44,14],[45,5,45,14],[46,5,46,14],[52,15,52,18],[53,15,53,18],[54,15,54,18],[55,15,55,18],[56,15,56,18],[57,15,57,18],[58,15,58,18],[60,15,60,18],[26,19,26,38],[47,19,47,38],[48,19,48,38],[49,19,49,38],[50,19,50,38],[51,19,51,38],[52,19,52,38],[53,19,53,38],[54,19,54,38],[55,19,55,38],[56,19,56,38],[57,19,57,38],[44,15,44,18],[45,15,45,18],[27,15,27,18],[26,15,26,18],[58,0,58,14],[60,0,60,14],[60,19,60,38],[58,19,58,38],[27,19,27,38],[28,19,28,38],[29,19,29,38],[30,19,30,38],[31,19,31,38],[32,19,32,38],[33,19,33,38],[34,19,34,38],[35,19,35,38],[36,19,36,38],[37,19,37,38],[38,19,38,38],[39,19,39,38],[40,19,40,38],[41,19,41,38],[42,19,42,38],[43,19,43,38],[44,19,44,38],[45,19,45,38],[46,19,46,38],[65,29,65,33],[65,34,65,36],[65,37,65,38],[66,29,66,33],[66,34,66,36],[66,37,66,38],[64,28,66,28],[64,29,64,33],[76,29,76,33],[70,34,70,36],[64,34,64,36],[64,37,64,38],[73,0,73,33],[73,34,73,36],[73,37,73,38],[75,29,75,33],[69,37,69,38],[70,37,70,38],[71,37,71,38],[70,23,70,25],[71,23,71,25],[72,23,72,25],[70,26,70,27],[70,28,70,33],[96,0,96,14],[95,15,95,18],[95,19,95,38],[96,15,96,18],[96,19,96,38],[79,5,79,14],[90,5,90,14],[94,5,94,14],[82,5,82,14],[91,5,91,14],[92,5,92,14],[87,5,87,14],[93,5,93,14],[88,5,88,14],[83,5,83,14],[80,5,80,14],[81,5,81,14],[83,15,83,18],[83,19,83,38],[89,5,89,14],[90,1,94,4],[87,1,89,4],[82,1,84,4],[95,0,95,14],[99,1,99,20],[99,21,99,23],[99,24,99,38],[94,15,94,18],[94,19,94,38],[78,0,78,14],[79,0,94,0],[81,1,81,4],[80,1,80,4],[79,1,79,4],[86,1,86,4],[85,1,85,4],[89,15,89,18],[89,19,89,38],[90,15,90,18],[90,19,90,38],[91,15,91,18],[91,19,91,38],[92,15,92,18],[92,19,92,38],[93,15,93,18],[93,19,93,38],[84,15,84,18],[84,19,84,38],[59,0,59,14],[59,15,59,18],[59,19,59,38],[97,0,97,14],[97,15,97,18],[97,19,97,38],[62,1,62,20],[62,21,62,23],[62,24,62,38],[85,15,85,18],[85,19,85,38],[86,15,86,18],[86,19,86,38],[87,15,87,18],[87,19,87,38],[88,15,88,18],[88,19,88,38],[79,15,79,18],[80,15,80,18],[80,19,80,38],[81,15,81,18],[81,19,81,38],[82,15,82,18],[82,19,82,38]]}
["（様式第８－２号）"]
[]
["新型コロナウイルス感染症緊急包括支援交付金（介護分）に関する事業実績報告書（事業所単位）",null,null,null,null,null,null,null,null,null,null,null,null,null,null,null,null,null,null,null,null,null,null,null,null,null,null,null,null,null,null,null,null,null,null,null,null,null,null,null,null,null,null,null,null,null,null,null,null,null,null,null,null,null,null,null,null,null,null,null,null,null,null,null,null,null,null,null,null,null,null,null,null,null,null,null,null,null,null,"（１）①　",null,null,"（２）②"]
[null,null,null,null,null,null,null,null,null,null,null,null,null,null,null,null,null,null,null,null,null,null,null,null,null,null,null,null,null,null,null,null,null,null,null,null,null,null,null,null,null,null,null,null,null,null,null,null,null,null,null,null,null,null,null,null,null,null,null,null,null,null,null,null,null,null,null,null,null,null,null,null,null,null,null,null,null,null,null,"共通",null,"単価","共通"]
["施設概要",null,null,null,null,null,null,null,null,null,null,null,null,null,null,null,null,null,null,null,null,null,null,null,null,null,null,null,null,null,null,null,null,null,null,null,null,null,null,null,null,null,null,null,null,null,null,null,null,null,null,null,null,null,null,null,null,null,null,null,null,null,null,null,null,null,null,null,null,null,null,null,null,null,null,null,null,null,"通所介護事業所（通常規模型）",892,"/事業所",null,200,"/事業所"]
[null,null,null,null,null,null,null,null,null,null,null,null,null,null,null,null,null,null,null,null,null,null,null,null,null,null,null,null,null,null,null,null,null,null,null,null,null,null,null,null,null,null,null,null,null,null,null,null,null,null,null,null,null,null,null,null,null,null,null,null,null,null,null,null,null,null,null,null,null,null,null,null,null,null,null,null,null,null,"通所介護事業所（大規模型（Ⅰ））",1137,"/事業所",null,200,"/事業所"]
["介護保険事業所番号",null,null,null,null,null,null,null,null,null,null,null,null,null,"事業所名称",null,null,null,null,null,null,null,null,null,null,null,null,null,null,null,null,null,null,null,null,null,null,null,null,null,null,null,null,null,null,null,null,null,null,null,null,null,null,null,null,null,null,null,null,null,null,null,null,null,null,null,null,null,null,null,null,null,null,null,null,null,null,null,"通所介護事業所（大規模型（Ⅱ））",1480,"/事業所",null,200,"/事業所"]
["所在地",null,null,"郵便番号",null,null,null,"都道府県名",null,null,null,"住所",null,null,null,null,null,null,null,null,null,null,null,null,null,"連絡先",null,null,"電話番号",null,null,null,null,"担当部署名",null,null,null,null,null,null,null,null,null,null,null,null,null,null,null,null,null,null,null,null,null,null,null,null,null,null,null,null,null,null,null,null,null,null,null,null,null,null,null,null,null,null,null,null,"地域密着型通所介護事業所(療養通所介護事業所を含む)",384,"/事業所",null,200,"/事業所"]
[null,null,null,null,null,null,null,null,null,null,null,null,null,null,null,null,null,null,null,null,null,null,null,null,null,null,null,null,null,null,null,null,null,null,null,null,null,null,null,null,null,null,null,null,null,null,null,null,null,null,null,null,null,null,null,null,null,null,null,null,null,null,null,null,null,null,null,null,null,null,null,null,null,null,null,null,null,null,"認知症対応型通所介護事業所",375,"/事業所",null,200,"/事業所"]
["提供サービス",null,null,null,null,null,null,null,null,null,null,null,null,null,null,null,null,"サービス種類コード",null,null,null,null,null,null,null,"定員",null,null,null,null,"人",null,"職員数\n(派遣含む)",null,null,null,null,"人",null,null,null,null,null,null,null,null,null,null,null,null,null,null,null,null,null,null,null,null,null,null,null,null,null,null,null,null,null,null,null,null,null,null,null,null,null,null,null,null,"通所リハビリテーション事業所（通常規模型）",939,"/事業所",null,200,"/事業所"]
{"$rows_left_out":93}
{"sheet":"職員表","index":5,"n_rows":85,"n_cols":21,"rows_kept":85,"cut":false,"hidden":false,"merged":[[3,15,3,18],[3,19,3,20],[3,0,4,0],[3,6,4,6],[3,7,3,9],[3,14,4,14],[3,1,4,1],[3,2,4,2],[3,3,4,3],[3,10,3,13]]}
["（様式第８－３号）介護慰労金受給職員表（法人単位）"]
[]
["※　本表は法人単位でまとめて記載すること。"]
[null,"氏名\n（漢字）","氏名\n（全角カナ）","生年月日\n（西暦）",null,null,"本人の住所","主たる勤務先",null,null,"分類",null,null,null,"慰労金\n(万円)","確認事項",null,null,null,"支払実績"]
[null,null,null,null,"（確認用）","（確認用）",null,"事業所番号","サービス種類コード","事業所・施設の名称","施設区分","対応区分","(計算用)","他の施設等との期間通算がある場合その施設名",null,"委任状の有無","他法人での慰労金の申請の有無","業務委託による\n従事者","重複\n申請者確認用","支払年月日\n(西暦)","支払金額\n（円）"]
[{"$f":"ROW()-5","v":1},null,null,null,{"$f":"B6&C6&D6","v":""},{"$f":"IF(E6=\"\",\"\",COUNTIF($E$6:$E$85,E6))","v":""},null,null,null,null,null,null,{"$f":"K6&L6","v":""},null,{"$f":"IFERROR(VLOOKUP(M6,計算用!$A$8:$B$15,2,FALSE),\"\")","v":""},null,null,null,{"$f":"IF(F6>=2,\"\",\"可\")","v":""}]
[{"$f":"ROW()-5","v":2},null,null,null,{"$f":"B7&C7&D7","v":""},{"$f":"IF(E7=\"\",\"\",COUNTIF($E$6:$E$85,E7))","v":""},null,null,null,null,null,null,{"$f":"K7&L7","v":""},null,{"$f":"IFERROR(VLOOKUP(M7,計算用!$A$8:$B$15,2,FALSE),\"\")","v":""},null,null,null,{"$f":"IF(F7>=2,\"\",\"可\")","v":""}]
[3,null,null,null,{"$f":"B8&C8&D8","v":""},{"$f":"IF(E8=\"\",\"\",COUNTIF($E$6:$E$85,E8))","v":""},null,null,null,null,null,null,"",null,{"$f":"IFERROR(VLOOKUP(M8,計算用!$A$8:$B$15,2,FALSE),\"\")","v":""},null,null,null,""]
[4,null,null,null,"",{"$f":"IF(E9=\"\",\"\",COUNTIF($E$6:$E$85,E9))","v":""},null,null,null,null,null,null,"",null,{"$f":"IFERROR(VLOOKUP(M9,計算用!$A$8:$B$15,2,FALSE),\"\")","v":""},null,null,null,""]
[5,null,null,null,"","",null,null,null,null,null,null,"",null,{"$f":"IFERROR(VLOOKUP(M10,計算用!$A$8:$B$15,2,FALSE),\"\")","v":""},null,null,null,""]
{"$rows_left_out":76}
{"sheet":"計算用","index":6,"n_rows":67,"n_cols":8,"rows_kept":67,"cut":false,"hidden":true,"merged":[]}
[null,null,null,null,null,null,null,"※本シートは絶対に編集しないこと。"]
["施設区分"]
["陽性者(濃厚接触者)発生施設","通所系･施設系で1日以上勤務又は訪問系で陽性者等に1日以上対応","訪問系で陽性者等への対応はないが対象期間に10日以上勤務","対象期間の勤務が９日以下"]
["その他の施設","対象期間に10日以上勤務","対象期間の勤務が9日以下"]
[]
[]
["慰労金単価"]
[{"$f":"A3&B3","v":"陽性者(濃厚接触者)発生施設通所系･施設系で1日以上勤務又は訪問系で陽性者等に1日以上対応"},20]
[{"$f":"A3&C3","v":"陽性者(濃厚接触者)発生施設訪問系で陽性者等への対応はないが対象期間に10日以上勤務"},5]
[{"$f":"A3&D3","v":"陽性者(濃厚接触者)発生施設対象期間の勤務が９日以下"},0]
{"$rows_left_out":57}